Data i hora oficial: dimarts 27 de octubre de 2020, 20:06:34
Sincronitza Interrupcions
Butlletins oficials
Grails Runtime Exception

Grails Runtime Exception

Error Details

Error 500: null
Servlet:
URI:
Exception Message: String index out of range: -1
Caused by: Error executing tag <g:render>: Error executing tag <g:pdfLink>: String index out of range: -1 at /WEB-INF/grails-app/views/layouts/personalitzacions/_tarragona.gsp:564 at /WEB-INF/grails-app/views/layouts/publicLayout.gsp:5
Class: CopiaAutenticaTagLib
At Line: [5]
Code Snippet:

Stack Trace

org.codehaus.groovy.grails.web.taglib.exceptions.GrailsTagException: Error executing tag <g:render>: Error executing tag <g:pdfLink>: String index out of range: -1 at /WEB-INF/grails-app/views/layouts/personalitzacions/_tarragona.gsp:564 at /WEB-INF/grails-app/views/layouts/publicLayout.gsp:5

at gsp_seuE11_layoutspublicLayout_gsp.run(gsp_seuE11_layoutspublicLayout_gsp.groovy:26)
at java.util.concurrent.ThreadPoolExecutor$Worker.runTask(ThreadPoolExecutor.java:886)
at java.util.concurrent.ThreadPoolExecutor$Worker.run(ThreadPoolExecutor.java:908)
at java.lang.Thread.run(Thread.java:662)
Caused by: org.codehaus.groovy.grails.web.taglib.exceptions.GrailsTagException: Error executing tag <g:pdfLink>: String index out of range: -1 at /WEB-INF/grails-app/views/layouts/personalitzacions/_tarragona.gsp:564
at gsp_seuE11_layouts_personalitzacions_tarragona_gsp.run(gsp_seuE11_layouts_personalitzacions_tarragona_gsp.groovy:552)
... 4 more
Caused by: java.lang.StringIndexOutOfBoundsException: String index out of range: -1
at java.lang.String.substring(String.java:1931)
at java_lang_String$substring.call(Unknown Source)
at seue10.CopiaAutenticaTagLib$_closure2.doCall(CopiaAutenticaTagLib.groovy:29)
... 5 more